{"text_format":"1","workbook":"xlsx","n_sheets":5,"sheets":["Data Entry","ConduitMaster Report","Cable Totals Report","X-REF","Table"],"not_rendered":{"charts":0,"images":0,"macros":1,"external_links":0,"defined_names":2,"comments":0,"pivot_tables":2},"unopened":[],"bounds":{"document_bytes":16777216,"sheet_cells":100000,"rows_first":2000,"rows_last":500,"rows_between":2000,"halvings":0,"cell_chars":16384,"cell_head_chars":4096},"cells_cut":0,"cells_raw":0,"read":"whole","date_system":"1900"}

{"sheet":"Data Entry","index":0,"n_rows":41,"n_cols":18,"rows_kept":41,"cut":false,"hidden":false,"merged":[[7,2,7,12],[0,0,0,15],[37,6,37,9],[1,0,1,14],[2,2,2,14],[3,2,3,14],[4,2,4,14],[5,2,5,10],[9,6,9,7],[6,2,6,7]]}
["Liberty Wire & Cable ConduitMasterTM Capacity Calculator*"]
["Instructions:  "]
[null,null,"1.  Set your desired conduit fill ratio in the Drop Down Box.  This globally sets the fill factor.  You can indiviudally set each fill cell.  Clicking \"Reset Form\" resets to global.**"]
[null,null,"2.  If conduit size is already known, enter it in the \"Conduit Size\" or leave blank and the program will automatically suggest a size.  This tool uses the EMT schedule."]
[null,null,"3.  Enter the correct Liberty Wire & Cable part numbers (not case sensitive), or correct competitive part numbers."]
[null,null,"4.  Be sure to enter the correct quantity in the \"QTY\" column, ie. 1, 2, 3, 4, etc"]
[null,null,"5.  It is necessary to assign a conduit number to each entry. "]
[null,null,"6.  When finished with entries, click on \"Calculate\" button.  This will send you to the ConduitMaster Report Tab.  Any new entries require recalculation."]
[]
[null,"Revision:  April 2, 2015",null,null,null,null,"Choose Conduit Fill Factor"]
[null,null,null,null,null,null,"**The NEC guideline of permissible fill is typically 53% for a single cable, and 40% for three or more cables."]
["Item #","QTY","Assign Conduit Number","Conduit Size","Conduit Length","Conduit Fill %","Liberty Part Number","Competitive Part #","Liberty Cable Utilized","Cable O.D.","Cable Area","Conduit I.D. (in.) Needed ","Useable area (sq.in.)","Available Area(sq in)","Percent Filled","Total Cable + 10%"]
[1,null,null,null,null,{"$f":"$R$16","v":0.4},null,null,{"$f":"IF(G13>0,UPPER(G13),IF(H13>0,VLOOKUP('Data Entry'!H13,'X-REF'!$A$1:$B$473,2,FALSE),\"\"))","v":""},{"$f":"IF(G13>0,VLOOKUP(I13,Table!$A$2:$B$2412,2,FALSE),IF(H13>0,VLOOKUP(I13,Table!$A$2:$B$2412,2,FALSE),\"\"))","v":""},{"$f":"IF(B13=0,\"\",IF(ISNA(J13)=TRUE,\"\",IF(G13>0,((J13/2)*(J13/2)*3.142)*B13,IF(H13>0,((J13/2)*(J13/2)*3.142)*B13,\"\"))))","v":""},{"$f":"IF(B13=0,\"\",K13/F13)","v":""},{"$f":"IF(B13=0,\"\",IF(D13=0,(((L13/2)*(L13/2))*3.142)*R16,(((D13/2)*(D13/2))*3.142)*F13))","v":""},{"$f":"IF(B13=0,\"\",IF(D13=0,((L13/2)*(L13/2))*3.142,((D13/2)*(D13/2))*3.142))","v":""},{"$f":"IF(B13=0,\"\",K13/D13)","v":""},{"$f":"IF(E13>0,(E13*B13)*110%,\"\")","v":""}]
[{"$f":"A13+1","v":2},null,null,{"$f":"IF(B14=0,\"\",VLOOKUP(SUMIF($C$13:$C$37,C14,$K$13:$K$37)/F14,Table!$F$2:$G$17,2,TRUE))","v":""},null,0.4,null,null,{"$f":"IF(G14>0,UPPER(G14),IF(H14>0,VLOOKUP('Data Entry'!H14,'X-REF'!$A$1:$B$473,2,FALSE),\"\"))","v":""},{"$f":"IF(G14>0,VLOOKUP(I14,Table!$A$2:$B$2412,2,FALSE),IF(H14>0,VLOOKUP(I14,Table!$A$2:$B$2412,2,FALSE),\"\"))","v":""},"",{"$f":"IF(B14=0,\"\",K14/F14)","v":""},{"$f":"IF(B14=0,\"\",IF(D14=0,(((L14/2)*(L14/2))*3.142)*R17,(((D14/2)*(D14/2))*3.142)*F14))","v":""},"",{"$f":"IF(B14=0,\"\",K14/D14)","v":""},{"$f":"IF(E14>0,(E14*B14)*110%,\"\")","v":""}]
[{"$f":"A14+1","v":3},null,null,{"$f":"IF(B15=0,\"\",VLOOKUP(SUMIF($C$13:$C$37,C15,$K$13:$K$37)/F15,Table!$F$2:$G$17,2,TRUE))","v":""},null,0.4,null,null,{"$f":"IF(G15>0,UPPER(G15),IF(H15>0,VLOOKUP('Data Entry'!H15,'X-REF'!$A$1:$B$473,2,FALSE),\"\"))","v":""},{"$f":"IF(G15>0,VLOOKUP(I15,Table!$A$2:$B$2412,2,FALSE),IF(H15>0,VLOOKUP(I15,Table!$A$2:$B$2412,2,FALSE),\"\"))","v":""},"","","","","","",0.05,8]
[4,null,null,{"$f":"IF(B16=0,\"\",VLOOKUP(SUMIF($C$13:$C$37,C16,$K$13:$K$37)/F16,Table!$F$2:$G$17,2,TRUE))","v":""},null,0.4,null,null,{"$f":"IF(G16>0,UPPER(G16),IF(H16>0,VLOOKUP('Data Entry'!H16,'X-REF'!$A$1:$B$473,2,FALSE),\"\"))","v":""},{"$f":"IF(G16>0,VLOOKUP(I16,Table!$A$2:$B$2412,2,FALSE),IF(H16>0,VLOOKUP(I16,Table!$A$2:$B$2412,2,FALSE),\"\"))","v":""},"","","","","","",0.1,{"$f":"INDEX(Q15:Q25,R15)","v":0.4}]
[5,null,null,{"$f":"IF(B17=0,\"\",VLOOKUP(SUMIF($C$13:$C$37,C17,$K$13:$K$37)/F17,Table!$F$2:$G$17,2,TRUE))","v":""},null,0.4,null,null,{"$f":"IF(G17>0,UPPER(G17),IF(H17>0,VLOOKUP('Data Entry'!H17,'X-REF'!$A$1:$B$473,2,FALSE),\"\"))","v":""},{"$f":"IF(G17>0,VLOOKUP(I17,Table!$A$2:$B$2412,2,FALSE),IF(H17>0,VLOOKUP(I17,Table!$A$2:$B$2412,2,FALSE),\"\"))","v":""},"","","","","","",0.15]
[6,null,null,{"$f":"IF(B18=0,\"\",VLOOKUP(SUMIF($C$13:$C$37,C18,$K$13:$K$37)/F18,Table!$F$2:$G$17,2,TRUE))","v":""},null,0.4,null,null,{"$f":"IF(G18>0,UPPER(G18),IF(H18>0,VLOOKUP('Data Entry'!H18,'X-REF'!$A$1:$B$473,2,FALSE),\"\"))","v":""},{"$f":"IF(G18>0,VLOOKUP(I18,Table!$A$2:$B$2412,2,FALSE),IF(H18>0,VLOOKUP(I18,Table!$A$2:$B$2412,2,FALSE),\"\"))","v":""},"","","","","","",0.2]
[7,null,null,{"$f":"IF(B19=0,\"\",VLOOKUP(SUMIF($C$13:$C$37,C19,$K$13:$K$37)/F19,Table!$F$2:$G$17,2,TRUE))","v":""},null,0.4,null,null,{"$f":"IF(G19>0,UPPER(G19),IF(H19>0,VLOOKUP('Data Entry'!H19,'X-REF'!$A$1:$B$473,2,FALSE),\"\"))","v":""},{"$f":"IF(G19>0,VLOOKUP(I19,Table!$A$2:$B$2412,2,FALSE),IF(H19>0,VLOOKUP(I19,Table!$A$2:$B$2412,2,FALSE),\"\"))","v":""},"","","","","","",0.25]
[8,null,null,{"$f":"IF(B20=0,\"\",VLOOKUP(SUMIF($C$13:$C$37,C20,$K$13:$K$37)/F20,Table!$F$2:$G$17,2,TRUE))","v":""},null,0.4,null,null,{"$f":"IF(G20>0,UPPER(G20),IF(H20>0,VLOOKUP('Data Entry'!H20,'X-REF'!$A$1:$B$473,2,FALSE),\"\"))","v":""},{"$f":"IF(G20>0,VLOOKUP(I20,Table!$A$2:$B$2412,2,FALSE),IF(H20>0,VLOOKUP(I20,Table!$A$2:$B$2412,2,FALSE),\"\"))","v":""},"","","","","","",0.3]
[9,null,null,{"$f":"IF(B21=0,\"\",VLOOKUP(SUMIF($C$13:$C$37,C21,$K$13:$K$37)/F21,Table!$F$2:$G$17,2,TRUE))","v":""},null,0.4,null,null,{"$f":"IF(G21>0,UPPER(G21),IF(H21>0,VLOOKUP('Data Entry'!H21,'X-REF'!$A$1:$B$473,2,FALSE),\"\"))","v":""},{"$f":"IF(G21>0,VLOOKUP(I21,Table!$A$2:$B$2412,2,FALSE),IF(H21>0,VLOOKUP(I21,Table!$A$2:$B$2412,2,FALSE),\"\"))","v":""},"","","","","","",0.35]
[10,null,null,{"$f":"IF(B22=0,\"\",VLOOKUP(SUMIF($C$13:$C$37,C22,$K$13:$K$37)/F22,Table!$F$2:$G$17,2,TRUE))","v":""},null,0.4,null,null,{"$f":"IF(G22>0,UPPER(G22),IF(H22>0,VLOOKUP('Data Entry'!H22,'X-REF'!$A$1:$B$473,2,FALSE),\"\"))","v":""},{"$f":"IF(G22>0,VLOOKUP(I22,Table!$A$2:$B$2412,2,FALSE),IF(H22>0,VLOOKUP(I22,Table!$A$2:$B$2412,2,FALSE),\"\"))","v":""},"","","","","","",0.4]
[11,null,null,{"$f":"IF(B23=0,\"\",VLOOKUP(SUMIF($C$13:$C$37,C23,$K$13:$K$37)/F23,Table!$F$2:$G$17,2,TRUE))","v":""},null,0.4,null,null,{"$f":"IF(G23>0,UPPER(G23),IF(H23>0,VLOOKUP('Data Entry'!H23,'X-REF'!$A$1:$B$473,2,FALSE),\"\"))","v":""},{"$f":"IF(G23>0,VLOOKUP(I23,Table!$A$2:$B$2412,2,FALSE),IF(H23>0,VLOOKUP(I23,Table!$A$2:$B$2412,2,FALSE),\"\"))","v":""},"","","",{"$f":"IF(B23=0,\"\",IF(D23=0,((L23/2)*(L23/2))*3.142,((D23/2)*(D23/2))*3.142))","v":""},"","",0.45]
[12,null,null,{"$f":"IF(B24=0,\"\",VLOOKUP(SUMIF($C$13:$C$37,C24,$K$13:$K$37)/F24,Table!$F$2:$G$17,2,TRUE))","v":""},null,0.4,null,null,{"$f":"IF(G24>0,UPPER(G24),IF(H24>0,VLOOKUP('Data Entry'!H24,'X-REF'!$A$1:$B$473,2,FALSE),\"\"))","v":""},{"$f":"IF(G24>0,VLOOKUP(I24,Table!$A$2:$B$2412,2,FALSE),IF(H24>0,VLOOKUP(I24,Table!$A$2:$B$2412,2,FALSE),\"\"))","v":""},"","","","","","",0.5]
[13,null,null,{"$f":"IF(B25=0,\"\",VLOOKUP(SUMIF($C$13:$C$37,C25,$K$13:$K$37)/F25,Table!$F$2:$G$17,2,TRUE))","v":""},null,0.4,null,null,{"$f":"IF(G25>0,UPPER(G25),IF(H25>0,VLOOKUP('Data Entry'!H25,'X-REF'!$A$1:$B$473,2,FALSE),\"\"))","v":""},{"$f":"IF(G25>0,VLOOKUP(I25,Table!$A$2:$B$2412,2,FALSE),IF(H25>0,VLOOKUP(I25,Table!$A$2:$B$2412,2,FALSE),\"\"))","v":""},"","","","","","",0.55000000000000004]
[14,null,null,{"$f":"IF(B26=0,\"\",VLOOKUP(SUMIF($C$13:$C$37,C26,$K$13:$K$37)/F26,Table!$F$2:$G$17,2,TRUE))","v":""},null,0.4,null,null,{"$f":"IF(G26>0,UPPER(G26),IF(H26>0,VLOOKUP('Data Entry'!H26,'X-REF'!$A$1:$B$473,2,FALSE),\"\"))","v":""},{"$f":"IF(G26>0,VLOOKUP(I26,Table!$A$2:$B$2412,2,FALSE),IF(H26>0,VLOOKUP(I26,Table!$A$2:$B$2412,2,FALSE),\"\"))","v":""},"","","","","",""]
[15,null,null,{"$f":"IF(B27=0,\"\",VLOOKUP(SUMIF($C$13:$C$37,C27,$K$13:$K$37)/F27,Table!$F$2:$G$17,2,TRUE))","v":""},null,0.4,null,null,{"$f":"IF(G27>0,UPPER(G27),IF(H27>0,VLOOKUP('Data Entry'!H27,'X-REF'!$A$1:$B$473,2,FALSE),\"\"))","v":""},{"$f":"IF(G27>0,VLOOKUP(I27,Table!$A$2:$B$2412,2,FALSE),IF(H27>0,VLOOKUP(I27,Table!$A$2:$B$2412,2,FALSE),\"\"))","v":""},"","","","","",""]
[16,null,null,{"$f":"IF(B28=0,\"\",VLOOKUP(SUMIF($C$13:$C$37,C28,$K$13:$K$37)/F28,Table!$F$2:$G$17,2,TRUE))","v":""},null,0.4,null,null,{"$f":"IF(G28>0,UPPER(G28),IF(H28>0,VLOOKUP('Data Entry'!H28,'X-REF'!$A$1:$B$473,2,FALSE),\"\"))","v":""},{"$f":"IF(G28>0,VLOOKUP(I28,Table!$A$2:$B$2412,2,FALSE),IF(H28>0,VLOOKUP(I28,Table!$A$2:$B$2412,2,FALSE),\"\"))","v":""},"","","","","",""]
[17,null,null,{"$f":"IF(B29=0,\"\",VLOOKUP(SUMIF($C$13:$C$37,C29,$K$13:$K$37)/F29,Table!$F$2:$G$17,2,TRUE))","v":""},null,0.4,null,null,{"$f":"IF(G29>0,UPPER(G29),IF(H29>0,VLOOKUP('Data Entry'!H29,'X-REF'!$A$1:$B$473,2,FALSE),\"\"))","v":""},{"$f":"IF(G29>0,VLOOKUP(I29,Table!$A$2:$B$2412,2,FALSE),IF(H29>0,VLOOKUP(I29,Table!$A$2:$B$2412,2,FALSE),\"\"))","v":""},"","","","","",""]
[18,null,null,{"$f":"IF(B30=0,\"\",VLOOKUP(SUMIF($C$13:$C$37,C30,$K$13:$K$37)/F30,Table!$F$2:$G$17,2,TRUE))","v":""},null,0.4,null,null,{"$f":"IF(G30>0,UPPER(G30),IF(H30>0,VLOOKUP('Data Entry'!H30,'X-REF'!$A$1:$B$473,2,FALSE),\"\"))","v":""},{"$f":"IF(G30>0,VLOOKUP(I30,Table!$A$2:$B$2412,2,FALSE),IF(H30>0,VLOOKUP(I30,Table!$A$2:$B$2412,2,FALSE),\"\"))","v":""},"","","","","",""]
[19,null,null,{"$f":"IF(B31=0,\"\",VLOOKUP(SUMIF($C$13:$C$37,C31,$K$13:$K$37)/F31,Table!$F$2:$G$17,2,TRUE))","v":""},null,0.4,null,null,{"$f":"IF(G31>0,UPPER(G31),IF(H31>0,VLOOKUP('Data Entry'!H31,'X-REF'!$A$1:$B$473,2,FALSE),\"\"))","v":""},{"$f":"IF(G31>0,VLOOKUP(I31,Table!$A$2:$B$2412,2,FALSE),IF(H31>0,VLOOKUP(I31,Table!$A$2:$B$2412,2,FALSE),\"\"))","v":""},"","","","","",""]
[20,null,null,{"$f":"IF(B32=0,\"\",VLOOKUP(SUMIF($C$13:$C$37,C32,$K$13:$K$37)/F32,Table!$F$2:$G$17,2,TRUE))","v":""},null,0.4,null,null,{"$f":"IF(G32>0,UPPER(G32),IF(H32>0,VLOOKUP('Data Entry'!H32,'X-REF'!$A$1:$B$473,2,FALSE),\"\"))","v":""},{"$f":"IF(G32>0,VLOOKUP(I32,Table!$A$2:$B$2412,2,FALSE),IF(H32>0,VLOOKUP(I32,Table!$A$2:$B$2412,2,FALSE),\"\"))","v":""},"","","","","",""]
[21,null,null,{"$f":"IF(B33=0,\"\",VLOOKUP(SUMIF($C$13:$C$37,C33,$K$13:$K$37)/F33,Table!$F$2:$G$17,2,TRUE))","v":""},null,0.4,null,null,{"$f":"IF(G33>0,UPPER(G33),IF(H33>0,VLOOKUP('Data Entry'!H33,'X-REF'!$A$1:$B$473,2,FALSE),\"\"))","v":""},{"$f":"IF(G33>0,VLOOKUP(I33,Table!$A$2:$B$2412,2,FALSE),IF(H33>0,VLOOKUP(I33,Table!$A$2:$B$2412,2,FALSE),\"\"))","v":""},"","","","","",""]
[22,null,null,{"$f":"IF(B34=0,\"\",VLOOKUP(SUMIF($C$13:$C$37,C34,$K$13:$K$37)/F34,Table!$F$2:$G$17,2,TRUE))","v":""},null,0.4,null,null,{"$f":"IF(G34>0,UPPER(G34),IF(H34>0,VLOOKUP('Data Entry'!H34,'X-REF'!$A$1:$B$473,2,FALSE),\"\"))","v":""},{"$f":"IF(G34>0,VLOOKUP(I34,Table!$A$2:$B$2412,2,FALSE),IF(H34>0,VLOOKUP(I34,Table!$A$2:$B$2412,2,FALSE),\"\"))","v":""},"","","","","","",{"$f":"(((100%-(INDEX($Q$15:$Q$30,$R$15)))*2)*$K$38)+$K$38","v":0}]
[23,null,null,{"$f":"IF(B35=0,\"\",VLOOKUP(SUMIF($C$13:$C$37,C35,$K$13:$K$37)/F35,Table!$F$2:$G$17,2,TRUE))","v":""},null,0.4,null,null,{"$f":"IF(G35>0,UPPER(G35),IF(H35>0,VLOOKUP('Data Entry'!H35,'X-REF'!$A$1:$B$473,2,FALSE),\"\"))","v":""},{"$f":"IF(G35>0,VLOOKUP(I35,Table!$A$2:$B$2412,2,FALSE),IF(H35>0,VLOOKUP(I35,Table!$A$2:$B$2412,2,FALSE),\"\"))","v":""},"","","","","",""]
[24,null,null,{"$f":"IF(B36=0,\"\",VLOOKUP(SUMIF($C$13:$C$37,C36,$K$13:$K$37)/F36,Table!$F$2:$G$17,2,TRUE))","v":""},null,0.4,null,null,{"$f":"IF(G36>0,UPPER(G36),IF(H36>0,VLOOKUP('Data Entry'!H36,'X-REF'!$A$1:$B$473,2,FALSE),\"\"))","v":""},{"$f":"IF(G36>0,VLOOKUP(I36,Table!$A$2:$B$2412,2,FALSE),IF(H36>0,VLOOKUP(I36,Table!$A$2:$B$2412,2,FALSE),\"\"))","v":""},"","","","","",""]
[25,null,null,{"$f":"IF(B37=0,\"\",VLOOKUP(SUMIF($C$13:$C$37,C37,$K$13:$K$37)/F37,Table!$F$2:$G$17,2,TRUE))","v":""},null,0.4,null,null,{"$f":"IF(G37>0,UPPER(G37),IF(H37>0,VLOOKUP('Data Entry'!H37,'X-REF'!$A$1:$B$473,2,FALSE),\"\"))","v":""},{"$f":"IF(G37>0,VLOOKUP(I37,Table!$A$2:$B$2412,2,FALSE),IF(H37>0,VLOOKUP(I37,Table!$A$2:$B$2412,2,FALSE),\"\"))","v":""},"","","","","",""]
[null,null,null,{"$f":"IF(B38=0,\"\",VLOOKUP(SUMIF($C$13:$C$37,C38,$K$13:$K$37)/F38,Table!$F$2:$G$17,2,TRUE))","v":""},null,0.4]
["* Note: This Calculator is intended for general guidelines only.  Each installation has different restrictions and local codes."]
[]
[""]

{"sheet":"ConduitMaster Report","index":1,"n_rows":2,"n_cols":11,"rows_kept":2,"cut":false,"hidden":false,"merged":[]}
["Assigned Conduit Number","Liberty Cables Utilized","Specified Conduit Size","Specified Conduit Fill %","Conduit Length","Cable Area","Cable O.D.","Percent Filled","Fill Total","Cable Count","Total Cable + 10%"]
["Grand Total"]

{"sheet":"Cable Totals Report","index":2,"n_rows":4,"n_cols":2,"rows_kept":4,"cut":false,"hidden":false,"merged":[[0,0,0,1]]}
["Cable Totals"]
["Liberty Cable List","Total Cable"]
[null,0]
["Grand Total",0]

{"sheet":"X-REF","index":3,"n_rows":954,"n_cols":2,"rows_kept":954,"cut":false,"hidden":true,"merged":[]}
[220,"22-2C-SO-HT"]
[221,"22-2C-GRY"]
[222,"20-2C-GRY"]
[224,"18-2C-GRY"]
[225,"16-2C-GRY"]
[226,"14-2C-GRY"]
[227,"12-2C-GRY"]
[230,"22-3C-SOL-GRY"]
[231,"22-3C-GRY-BX"]
[232,"20-3C-GRY"]
[234,"18-3C-GRY"]
[235,"16-3C-GRY"]
[240,"22-4C-SO-HT"]
[241,"22-4C-FPLP-RED"]
[241,"22-4C-GRY"]
[242,"20-4C-GRY"]
[244,"18-4C-GRY"]
[245,"16-4C-COM-GRY"]
[245,"16-4C-GRY"]
[246,"14-4C-GRY"]
[248,"12-4C-BLK"]
[248,"12-4C-GRY"]
[262,"20-5C-GRY"]
[270,"22-6C-GRY"]
[271,"22-8C-GRY"]
[272,"22-10C-GRY"]
[273,"22-12C-GRY"]
[274,"22-15C-GRY"]
[280,"18-5C-GRY"]
[281,"18-7C-GRY"]
[282,"18-9C-GRY"]
[283,"18-12C-GRY"]
[284,"18-15C-GRY"]
[285,"18-20C-GRY"]
[290,"22-2C-SOL-SH-GRY"]
[291,"22-2C-SH-GRY"]
[292,"20-2C-SH-GRY"]
[293,"18-2C-SH-GRY"]
[294,"16-2C-SH-GRY"]
[295,"14-2C-SH-GRY"]
[296,"12-2C-SH-GRY"]
[300,"22-3C-SOL-SH-GRY"]
[301,"22-3C-SH-GRY"]
[302,"20-3C-SH-GRY"]
[303,"18-3C-SH-GRY"]
[357,"22-2P-SH/UN-BLU"]
[440,"18-2P-INDSH-GRY"]
[570,"22-6C-SOL-GRY"]
[663,"16-7C-GRY"]
[700,"14-4C-FPLR-RED"]
[806,"RG6-CCTV-CM-BLK"]
[810,"RG8/U-STR-BLK"]
[811,"RG11-CCTV-BLK"]
[812,"RG58-PVC"]
[813,"RG58-CMR-BLK"]
[815,"RG59-CCTV-CM-BLK"]
[816,"RG59-STR-BLK"]
[819,"20-CMR-VIDEO-BLK"]
[821,"RG11-CATV-BLK"]
[841,"RG6-BC-CATV-BLK"]
[975,"18-2C-FPLRSH-RED"]
[977,"18-4C-FPLRSH-RED"]
[980,"18-2C-FPLR-RED"]
[982,"18-4C-FPLR-RED"]
[984,"18-6C-FPLR-RED"]
[990,"16-2C-FPLR-RED"]
[991,"16-2C-FPLRSH-RED"]
[992,"16-4C-FPLR-RED"]
[993,"16-4C-FPLRSH-RED"]
[994,"14-2C-FPLR-RED"]
[995,"14-2C-FPLRSH-RED"]
[998,"12-2C-FPLR-RED"]
[999,"12-2C-FPLRSH-RED"]
[1083,"22-4C-FPLR-RED"]
[1100,"RG11-CATV-BLK"]
[1110,"RG11-CATV-DB"]
[1135,"RG11-EX-SD-BLK"]
[1165,"RG11-TRIAXIAL-CAMERA"]
[2542,"22-2P-SIAM-EZ"]
[3011,"20-4C-SH-GRY"]
[3021,"18-6C-SH-GRY"]
[3241,"22-4C-SH-GRY"]
[3244,"18-4C-SH-GRY"]
[3245,"16-4C-SH-GRY"]
[3262,"20-5C-SH-GRY"]
[3263,"20-7C-SH-GRY"]
[3264,"20-9C-SH-GRY"]
[3265,"20-12C-SH-GRY"]
[3270,"22-6C-SH-GRY"]
[3271,"22-8C-SH-GRY"]
[3272,"22-10C-SH-GRY"]
[3272,"22-10C-SH-GRY-BX"]
[3274,"22-15C-SH-GRY"]
[3280,"18-5C-SH-GRY"]
[3751,"18-2P-OSH-GRY"]
[3811,"RG11-CM-TRIAX"]
[4245,"24-4P-L5-EN-BLU"]
[4246,"24-4P-L6-EN-BLU"]
[4806,"RG6-BC-CATV-DB"]
[4811,"RG11-BC-CATV-DB"]
[4815,"RG59-DB-CCTV"]
[5994,"RG59-TRIAXIAL-CAMERA"]
[6100,"RG6-CM-BLK"]
[6140,"RG6-CATV-DB"]
[6300,"QUADFLEX-BLK"]
[6310,"RG6-QUAD-DB"]
[6325,"RG6-DB-CCTV"]
[6350,"18-CMR-SD-BLK"]
[8195,"RGB5C-20-CMR"]
[8281,"20-DBLSH-BROADCAST-C"]
[8471,"16-2C-COM-GRY"]
[8503,"22-1C-HOOKUP-BLK"]
[8767,"22-3P-INDSH-GRY"]
[9066,"RG6-CATV-DB"]
[9110,"RG59-CATV-BLK"]
[9116,"RG6-CM-WHT"]
[9451,"22-1P-EZ-BLK"]
[9452,"24-1P-EZ-BLK"]
[9708,"18-2C-ZIP-BLK"]
[9712,"22-2C-ZIP-WHT"]
[9729,"24-2P-485-GRY"]
[9773,"18-2P-INDSH-GRY"]
[9873,"20-3P-INDSH-GRY"]
[19206,"12-3C-SJOW"]
[25210,"10-2C-TTP-WHT"]
[25291,"22-1P-CMP-EZ-WHT"]
[25806,"RG6-CCTV-PL-WHT"]
[25811,"RG11-CCTV-PL-WHT"]
[25815,"RG59-CCTV-PL-WHT"]
[25819,"20-CMP-VID-COAX-WHT"]
[25821,"RG11-P-CATV-WHT"]
[25841,"RG6-P-CATV-WHT"]
[77350,"AXLINK"]
[77350,"LLINX-U "]
[77510,"22-2P-INDSH-GRY"]
[82240,"RG58-CMP-WHT-RAN"]
[82504,"24-4P-PLCSH-WHT"]
[82723,"22-2P-PINDSH-WHT"]
[82761,"22-1P-CMP-EZ-BLK"]
[88240,"RG58-CMP-WHT"]
[88723,"22-2P-PINDSH-BLK"]
[89913,"RG8-CMP-BLK"]
[89913,"RG8-IIIVSAT-P-KYNAR"]
[89913,"WBC-400P"]
[210454,"22-2P-SIAM-EZ"]
[252815,"RG59-18/2C-PS"]
[252815,"RG59CM-18-2C"]
[252825,"SV-25-CMP"]
[254245,"24-4P-P-L5-EN-BLU"]
[254245,"24-4P-P-L5-EN-WHT"]
[254246,"24-4P-P-L6-EN-BLU"]
[256100,"RG6-P-CATV-WHT"]
[256300,"RG6-QUAD-PL-WHT"]
[256350,"18-CMP-VID-COAX-WHT"]
[258255,"RGB5C-25-CMP"]
[258265,"RGB5C-PLN"]
[513945,"RG11-CCTV-BLK"]
[533945,"RG6-CCTV-CM-BLK"]
[539945,"RG6-18-2C"]
[543945,"RG59-CCTV-CM-BLK"]
[549945,"RG59CM-18-2C"]
[551945,"RG59-STR-BLK"]
[613948,"RG11-CCTV-PL-WHT"]
[633938,"RG6-P-CATV-BLK"]
[633948,"RG6-CCTV-PL-WHT"]
[643948,"RG59-CCTV-PL-WHT"]
[649948,"RG59-18/2C-PS"]
["002320-11S","18-2C-PSH-WHT"]
["002330-S","18-3C-PSH-WHT"]
["002340-S","18-4C-PSH-WHT"]
["002350-S","18-5C-PSH-WHT"]
["002351-S","18-6C-PSH-WHT"]
["002352-S","18-8C-PSH-WHT"]
["002353-S","18-10C-PSH-WHT"]
["002360-S","18-2C-P-WHT"]
["002370-S","18-3C-P-WHT"]
["002380-S","18-4C-P-WHT"]
["002391-S","18-6C-P-WHT"]
["002392-S","18-8C-P-WHT"]
["002393-S","18-10C-P-WHT"]
["002394-S","18-12C-P-WHT"]
["003320-S","20-2C-PSH-WHT"]
["003330-S","20-3C-PSH-WHT"]
["003340-S","20-4C-PSH-WHT"]
["003350-S","20-5C-PSH-WHT"]
["003360-S","20-2C-P-WHT"]
["003370-S","20-3C-P-WHT"]
["003380-S","20-4C-P-WHT"]
["004320-S","22-2C-PSH-WHT"]
["004330-S","22-3C-PSH-WHT"]
["004340-S","22-4C-PSH-WHT"]
["004351-S","22-6C-PSH-WHT"]
["004352-S","22-8C-PSH-WHT"]
["004354-S","22-12C-PSH-WHT"]
["004360-S","22-2C-P-WHT"]
["004370-S","22-3C-P-WHT"]
["004380-S","22-4C-P-WHT"]
["004391-S","22-6C-P-WHT"]
["004392-S","22-8C-P-WHT"]
["007920-S","14-2C-PSH-WHT"]
{"$rows_left_out":755}
{"sheet":"Table","index":4,"n_rows":1730,"n_cols":7,"rows_kept":1730,"cut":false,"hidden":true,"merged":[]}
["ITEM_NBR","Diameter",null,null,null,"Range","Conduit Size"]
[221,0.12,null,null,null,1.0000000000000001E-5,0.5]
[224,0.156,null,null,null,0.622,0.5]
[225,0.182,null,null,null,0.623,0.75]
[226,0.23,null,null,null,0.82399999999999995,0.75]
[227,0.26300000000000001,null,null,null,0.82499999999999996,1]
[291,0.127,null,null,null,1.0489999999999999,1]
[293,0.16,null,null,null,1.05,1.25]
[294,0.186,null,null,null,1.38,1.25]
[454,0.13500000000000001,null,null,null,1.381,1.5]
[651,0.192,null,null,null,1.61,1.5]
[652,0.20499999999999999,null,null,null,1.611,2]
[654,0,null,null,null,2.0670000000000002,2]
[655,0,null,null,null,2.0680000000000001,2.5]
[751,0.25700000000000001,null,null,null,2.7309999999999999,2.5]
[2412,0.216,null,null,null,2.7320000000000002,3]
[8214,0.40300000000000002,null,null,null,3.3559999999999999,3]
[8477,0.38600000000000001,null,null,null,3.3570000000000002,3.5]
[8762,0.20399999999999999,null,null,null,3.8340000000000001,3.5]
[8770,0.246,null,null,null,3.835,4]
[9807,0.24,null,null,null,4.3339999999999996,4]
[9808,0.25600000000000001]
[9809,0.28999999999999998]
[9913,0.40500000000000003]
[9940,0.215]
[25210,0.25700000000000001]
[82778,0.314]
[89913,0.36]
[823225,0.28499999999999998]
[9020127,0.26600000000000001]
["002E58-31331-24",0.22600000000000001]
["002T58-31331-24",0.161]
["006TUC-T4180D20",0.48]
["01220",0.245]
["012E8F-31131-A1",0.49]
["012K8F-31130-29",0.26]
["012TU4-T4131A20",0.41]
["01380.35T",0.43]
["024E88-33131-A3",0.56000000000000005]
["024E8F-31131-29",0.31]
["024E8F-31131-A1",0.56999999999999995]
["024E8P-31131-29",0.31]
["024T88-33190-A3",0.56000000000000005]
["04-003-64",0.37]
["072EUF-T4101D20",0.51]
["10-1C-GROUND",0.15]
["10-2C-DB-BLK",0.42599999999999999]
["10-2C-EX+-WHT",0.38500000000000001]
["10-2C-KO+-TEA",0.37]
["10-2C-LE-DB",0.44]
["10-2C-TTP-WHT",0.316]
["10-2C-VNTC-BLK",0.43099999999999999]
["1057A",0.47199999999999998]
["10GX12-0031000",0.29499999999999998]
["10GX12-0101000",0.29499999999999998]
["10-THHN-SOL-BLK",0.15]
["10-THHN-SOL-GRN",0.15]
["10-THHN-STR-BLK",0.16500000000000001]
["10-THHN-STR-BLU",0.16500000000000001]
["10-THHN-STR-BRN",0.16500000000000001]
["10-THHN-STR-GRN",0.16500000000000001]
["10-THHN-STR-GRY",0.16500000000000001]
["10-THHN-STR-ORG",0.16500000000000001]
["10-THHN-STR-RED",0.16500000000000001]
["10-THHN-STR-VIO",0.16500000000000001]
["10-THHN-STR-WHT",0.16500000000000001]
["10-THHN-STR-YEL",0.16500000000000001]
["12-12C-VNTC-BLK",0.66500000000000004]
["12-1P-UC-BLK",0.38900000000000001]
["12-1P-UC-WHT",0.38900000000000001]
["12-1P-UC-WHT-500",0.38900000000000001]
["12-2C-BLK",0.28000000000000003]
["12-2C-BLK-500",0.28000000000000003]
["12-2C-DB-BLK",0.32200000000000001]
["12-2C-DB-BLK-500",0.32200000000000001]
["12-2C-EX+-TEA",0.32700000000000001]
["12-2C-EX+-WHT",0.32700000000000001]
["12-2C-FPLR-RED",0.24199999999999999]
["12-2C-GRY",0.28000000000000003]
["12-2C-HF-BLU",0.34]
["12-2C-LE-DB",0.39]
["12-2C-P-BLK",0.252]
["12-2C-P-BLK-500",0.252]
["12-2C-PSH-WHT",0.26400000000000001]
["12-2C-P-WHT",0.252]
["12-2C-P-WHT-500",0.252]
["12-2C-SH-GRY",0.27600000000000002]
["12-2C-TTP-BLU",0.27400000000000002]
["12-2C-TTP-WHT",0.27400000000000002]
["12-2C-TTP-WHT-500",0.27400000000000002]
["12-2C-VNTC-BLK",0.36099999999999999]
["12-2C-ZIP-CLR",0.19]
["12-2P-UC-WHT",0.47799999999999998]
["12-3C-P-WHT",0.26300000000000001]
["12-3C-P-WHT-500",0.26300000000000001]
["12-3C-SJOW",0.43]
["12-4C-BLK",0.32600000000000001]
["12-4C-BLK-500",0.32600000000000001]
["12-4C-DB-BLK",0.372]
["12-4C-EX+-TEA",0.39100000000000001]
["12-4C-EX+-WHT",0.39100000000000001]
["12-4C-EX-WHT",0.39100000000000001]
["12-4C-P-WHT",0.308]
["12-4C-VNTC-BLK",0.41499999999999998]
["124HBW",0.48]
["12-8C-STAGE",0.57999999999999996]
["12ACS50125OM3PE",0.35499999999999998]
["12ACS9125OS2PE",0.35499999999999998]
["12D50125MOM3P",0.11899999999999999]
["12D50125MOM3R",0.11899999999999999]
["12D50125MOM4P",0.11899999999999999]
["12D9125SMOS2P",0.11899999999999999]
["12IAD50125MOM3P",0.45700000000000002]
["12IAD9125SMOS2P",0.45700000000000002]
["12-THHN-STR-BLK",0.13500000000000001]
["12-THHN-STR-BLU",0.13500000000000001]
["12-THHN-STR-BRN",0.13500000000000001]
["12-THHN-STR-GRN",0.13500000000000001]
["12-THHN-STR-RED",0.13500000000000001]
["12-THHN-STR-WHT",0.13500000000000001]
["12-THHN-STR-YEL",0.13500000000000001]
["1300SB",0.26]
["1305A",0.29799999999999999]
["1314SB",0.29399999999999998]
["1316SB",0.34]
["13908",0.18]
["13911",0.219]
["14-10C-THHN-QP",0.45200000000000001]
["14-1P-UC-BLK",0.34699999999999998]
["14-1P-UC-WHT",0.34699999999999998]
["14-1P-UC-WHT-500",0.34699999999999998]
["14-2C-BLK",0.22800000000000001]
["14-2C-DB-BLK",0.28399999999999997]
["14-2C-DB-BLK-500",0.28399999999999997]
["14-2C-EX+-BLK",0.28699999999999998]
["14-2C-EX+-GRN",0.28699999999999998]
["14-2C-EX+-GRN-500",0.28699999999999998]
["14-2C-EX+-PNK",0.28699999999999998]
["14-2C-EX+-RBL",0.28699999999999998]
["14-2C-EX+-WHT",0.28699999999999998]
["14-2C-EX+-WHT-500",0.28699999999999998]
["14-2C-FPLP-RED",0.20399999999999999]
["14-2C-FPLPSH-RED",0.20399999999999999]
["14-2C-FPLR-BLK",0.2]
["14-2C-FPLR-RED",0.2]
["14-2C-GRY",0.22800000000000001]
["14-2C-HF-BLU",0.3]
["14-2C-HFSH-LBL",0.31]
["14-2C-HT",0.222]
["14-2C-KO+-BLK",0.26300000000000001]
["14-2C-KO+-WHT",0.26300000000000001]
["14-2C-KO+-WHT-500",0.26300000000000001]
["14-2C-KO+-WHT-5CS",0.26300000000000001]
["14-2C-KO+-WHT-BX",0.26300000000000001]
["14-2C-P-BLK",0.218]
["14-2C-P-BLK-500",0.218]
["14-2C-PLTC-GRY",0.27600000000000002]
["14-2C-PSH-WHT",0.216]
["14-2C-PSH-WHT-500",0.216]
["14-2C-P-VIO",0.218]
["14-2C-P-WHT",0.218]
["14-2C-P-WHT-500",0.218]
["14-2C-SH-GRY",0.223]
["14-2C-TF",0.224]
["14-2C-TTP-WHT",0.24]
["14-2C-TTP-WHT-500",0.24]
["14-2C-TTP-WHT-5CS",0.24]
["14-2C-VNTC-BLK",0.32300000000000001]
["14-2C-ZIP-CLR",0.17499999999999999]
["14-2P-UC-WHT",0.40799999999999997]
["14-4C-DB-BLK",0.315]
["14-4C-DB-BLK-500",0.315]
["14-4C-DB-BLK-5CS",0.315]
["14-4C-EX+-BLK",0.33100000000000002]
["14-4C-EX+-BLK-250",0.33100000000000002]
["14-4C-EX+-GRN",0.33100000000000002]
["14-4C-EX+-GRN-1000",0.33100000000000002]
["14-4C-EX+-PNK",0.33100000000000002]
["14-4C-EX+-RBL",0.33100000000000002]
["14-4C-EX+-WHT",0.33100000000000002]
["14-4C-FPLR-RED",0.247]
["14-4C-GRY",0.26700000000000002]
["14-4C-HF-BLU",0.35]
["14-4C-HFSH-BLU",0.35]
["14-4C-HFSH-BLU-500",0.35]
["14-4C-HT",0.26200000000000001]
["14-4C-HT-5CS",0.26200000000000001]
["14-4C-KO+-WHT",0.307]
["14-4C-KO+-WHT-1000",0.307]
["14-4C-KO+-WHT-5CS",0.307]
["14-4C-P-WHT",0.27]
["14-4C-P-WHT-500",0.27]
["14-4C-SJTOW-YEL",0.39500000000000002]
["14-4C-TF",0.29499999999999998]
["14-4C-VNTCSH-BLK",0.38]
["14-5C-THHN-QP",0.29899999999999999]
["14-6C-GLD",0.32]
["14-6C-THHN-QP",0.30499999999999999]
["14-THHN-BLK",0.112]
["14-THHN-GRN",0.112]
{"$rows_left_out":1530}